Reaction Details
TargetReverse transcriptase/RNaseH
LigandBDBM50411080
Substrate/Competitorn/a
Meas. Tech.ChEMBL_373029 (CHEMBL871573)
EC50 25800±n/a nM
Citation Mugnaini, CManetti, FEsté, JAClotet-Codina, IMaga, GCancio, RBotta, MCorelli, F Synthesis and biological investigation of S-aryl-S-DABO derivatives as HIV-1 inhibitors. Bioorg Med Chem Lett16:3541-4 (2006) 
 
Reverse transcriptase/RNaseH
Name:Reverse transcriptase/RNaseH
Type:PROTEIN
Mol. Mass.:65229.15
Organism:Human immunodeficiency virus 1
Description:ChEMBL_1473730
Residue:566
BDBM50411080
NameBDBM50411080
Synonyms:CHEMBL379575
TypeSmall organic molecule
Emp. Form.C18H12F4N2OS
Mol. Mass.380.359
SMILESCc1c(Cc2c(F)cccc2F)nc(Sc2ccc(F)cc2F)[nH]c1=O