Reaction Details
TargetReverse transcriptase/RNaseH
LigandBDBM50411078
Substrate/Competitorn/a
Meas. Tech.ChEMBL_373028 (CHEMBL871572)
EC50 2720±n/a nM
Citation Mugnaini, CManetti, FEsté, JAClotet-Codina, IMaga, GCancio, RBotta, MCorelli, F Synthesis and biological investigation of S-aryl-S-DABO derivatives as HIV-1 inhibitors. Bioorg Med Chem Lett16:3541-4 (2006) 
 
Reverse transcriptase/RNaseH
Name:Reverse transcriptase/RNaseH
Type:PROTEIN
Mol. Mass.:65229.15
Organism:Human immunodeficiency virus 1
Description:ChEMBL_1473730
Residue:566
BDBM50411078
NameBDBM50411078
Synonyms:CHEMBL211326
TypeSmall organic molecule
Emp. Form.C18H15Cl2N3O2S
Mol. Mass.408.302
SMILESCOc1ccc(Sc2nc(Cc3c(Cl)cccc3Cl)c(C)c(=O)[nH]2)cn1