Reaction Details
TargetReverse transcriptase/RNaseH
LigandBDBM50411081
Substrate/Competitorn/a
Meas. Tech.ChEMBL_373031 (CHEMBL871578)
EC50 12100±n/a nM
Citation Mugnaini, CManetti, FEsté, JAClotet-Codina, IMaga, GCancio, RBotta, MCorelli, F Synthesis and biological investigation of S-aryl-S-DABO derivatives as HIV-1 inhibitors. Bioorg Med Chem Lett16:3541-4 (2006) 
 
Reverse transcriptase/RNaseH
Name:Reverse transcriptase/RNaseH
Type:PROTEIN
Mol. Mass.:65229.15
Organism:Human immunodeficiency virus 1
Description:ChEMBL_1473730
Residue:566
BDBM50411081
NameBDBM50411081
Synonyms:CHEMBL208918
TypeSmall organic molecule
Emp. Form.C18H14Cl2N2OS
Mol. Mass.377.288
SMILESCc1c(Cc2c(Cl)cccc2Cl)nc(Sc2ccccc2)[nH]c1=O