Reaction Details
TargetUrotensin-2 receptor
LigandBDBM50002723
Substrate/Competitorn/a
Meas. Tech.ChEMBL_412858 (CHEMBL910631)
Ki 2.4±n/a nM
Citation Chatenet, DDubessy, CBoularan, CScalbert, EPfeiffer, BRenard, PLihrmann, IPacaud, PTonon, MCVaudry, HLeprince, J Structure-activity relationships of a novel series of urotensin II analogues: identification of a urotensin II antagonist. J Med Chem49:7234-8 (2006) 
 
Urotensin-2 receptor
Name:Urotensin-2 receptor
Type:Enzyme Catalytic Domain
Mol. Mass.:42159.71
Organism:Homo sapiens (Human)
Description:Urotensin-II UTS2R HUMAN::Q9UKP6
Residue:389
BDBM50002723
NameBDBM50002723
Synonyms:CHEMBL265166
TypeSmall organic molecule
Emp. Form.C50H63N11O14S2
Mol. Mass.1106.231
SMILESCC(C)[C@H](NC(=O)[C@@H]1CSSC[C@H](NC(=O)[C@@H](N)CC(O)=O)C(=O)N[C@@H](Cc2ccccc2)C(=O)N[C@@H](Cc2c[nH]c3ccccc23)C(=O)N[C@@H](CCCCN)C(=O)N[C@@H](Cc2ccc(O)c(c2)[N+]([O-])=O)C(=O)N1)C(O)=O