Reaction Details
TargetUrotensin-2 receptor
LigandBDBM50002728
Substrate/Competitorn/a
Meas. Tech.ChEMBL_412858 (CHEMBL910631)
Ki 2.2±n/a nM
Citation Chatenet, DDubessy, CBoularan, CScalbert, EPfeiffer, BRenard, PLihrmann, IPacaud, PTonon, MCVaudry, HLeprince, J Structure-activity relationships of a novel series of urotensin II analogues: identification of a urotensin II antagonist. J Med Chem49:7234-8 (2006) 
 
Urotensin-2 receptor
Name:Urotensin-2 receptor
Type:Enzyme Catalytic Domain
Mol. Mass.:42159.71
Organism:Homo sapiens (Human)
Description:Urotensin-II UTS2R HUMAN::Q9UKP6
Residue:389
BDBM50002728
NameBDBM50002728
Synonyms:CHEMBL218825
TypeSmall organic molecule
Emp. Form.C50H66N10O10S2
Mol. Mass.1031.25
SMILESCC(C)[C@H](NC(=O)[C@@H]1CSSC[C@H](NC(=O)C(C)(C)N)C(=O)N[C@@H](Cc2ccccc2)C(=O)N[C@@H](Cc2c[nH]c3ccccc23)C(=O)N[C@@H](CCCCN)C(=O)N[C@@H](Cc2ccc(O)cc2)C(=O)N1)C(O)=O