Reaction Details
TargetAlpha-1A adrenergic receptor
LigandBDBM50392638
Substrate/Competitorn/a
Meas. Tech.ChEMBL_412940 (CHEMBL910638)
Ki 11±n/a nM
Citation Pallavicini, MBudriesi, RFumagalli, LIoan, PChiarini, ABolchi, CUgenti, MPColleoni, SGobbi, MValoti, E WB4101-related compounds: new, subtype-selective alpha1-adrenoreceptor antagonists (or inverse agonists?). J Med Chem49:7140-9 (2006) 
 
Alpha-1A adrenergic receptor
Name:Alpha-1A adrenergic receptor
Type:Cell-surface receptors
Mol. Mass.:51511.67
Organism:Homo sapiens (Human)
Description:P35348
Residue:466
BDBM50392638
NameBDBM50392638
Synonyms:CHEMBL214986
TypeSmall organic molecule
Emp. Form.C19H23NO5
Mol. Mass.345.3896
SMILESCOc1cccc(OC)c1OCCNC[C@@H]1COc2ccccc2O1