Reaction Details
TargetAmine oxidase [flavin-containing] B
LigandBDBM50409083
Substrate/Competitorn/a
Meas. Tech.ChEMBL_417161 (CHEMBL909462)
IC50 1.12±n/a nM
Citation Novaroli, LDaina, AFavre, EBravo, JCarotti, ALeonetti, FCatto, MCarrupt, PAReist, M Impact of species-dependent differences on screening, design, and development of MAO B inhibitors. J Med Chem49:6264-72 (2006) 
 
Amine oxidase [flavin-containing] B
Name:Amine oxidase [flavin-containing] B
Type:Protein
Mol. Mass.:58768.76
Organism:Homo sapiens (Human)
Description:P27338
Residue:520
BDBM50409083
NameBDBM50409083
Synonyms:CHEMBL145292
TypeSmall organic molecule
Emp. Form.C20H14O3
Mol. Mass.302.3234
SMILESO=c1oc2cc(OCc3ccccc3)ccc2c2ccccc12