Reaction Details
TargetAmine oxidase [flavin-containing] B
LigandBDBM50231957
Substrate/Competitorn/a
Meas. Tech.ChEMBL_417161 (CHEMBL909462)
IC50 2.14±n/a nM
Citation Novaroli, LDaina, AFavre, EBravo, JCarotti, ALeonetti, FCatto, MCarrupt, PAReist, M Impact of species-dependent differences on screening, design, and development of MAO B inhibitors. J Med Chem49:6264-72 (2006) 
 
Amine oxidase [flavin-containing] B
Name:Amine oxidase [flavin-containing] B
Type:Protein
Mol. Mass.:58768.76
Organism:Homo sapiens (Human)
Description:P27338
Residue:520
BDBM50231957
NameBDBM50231957
Synonyms:7-(3-Chloro-benzyloxy)-3,4-dimethyl-chromen-2-one CHEMBL109018
TypeSmall organic molecule
Emp. Form.C18H15ClO3
Mol. Mass.314.763
SMILESCc1c(C)c(=O)oc2cc(OCc3cccc(Cl)c3)ccc12