Reaction Details
TargetAmine oxidase [flavin-containing] B
LigandBDBM50378564
Substrate/Competitorn/a
Meas. Tech.ChEMBL_417161 (CHEMBL909462)
IC50 1.7±n/a nM
Citation Novaroli, LDaina, AFavre, EBravo, JCarotti, ALeonetti, FCatto, MCarrupt, PAReist, M Impact of species-dependent differences on screening, design, and development of MAO B inhibitors. J Med Chem49:6264-72 (2006) 
 
Amine oxidase [flavin-containing] B
Name:Amine oxidase [flavin-containing] B
Type:Protein
Mol. Mass.:58768.76
Organism:Homo sapiens (Human)
Description:P27338
Residue:520
BDBM50378564
NameBDBM50378564
Synonyms:CHEMBL145781
TypeSmall organic molecule
Emp. Form.C16H12O3
Mol. Mass.252.2647
SMILESO=c1ccc2ccc(OCc3ccccc3)cc2o1