Reaction Details
TargetHistidine-rich protein PFHRP-II
LigandBDBM50202589
Substrate/Competitorn/a
Meas. Tech.ChEMBL_423821 (CHEMBL910656)
IC50 460±n/a nM
Citation Solomon, VRHaq, WSrivastava, KPuri, SKKatti, SB Synthesis and antimalarial activity of side chain modified 4-aminoquinoline derivatives. J Med Chem50:394-8 (2007) 
 
Histidine-rich protein PFHRP-II
Name:Histidine-rich protein PFHRP-II
Type:PROTEIN
Mol. Mass.:35156.49
Organism:Plasmodium falciparum
Description:ChEMBL_500704
Residue:332
BDBM50202589
NameBDBM50202589
Synonyms:2-(4-chloro-phenyl)-3-[3-(7-chloroquinolin-4-ylamino)-propyl]-2,3-dihydrobenzo[e][1,3]thiazin-4-one CHEMBL376236
TypeSmall organic molecule
Emp. Form.C26H21Cl2N3OS
Mol. Mass.494.435
SMILESClc1ccc(cc1)C1Sc2ccccc2C(=O)N1CCCNc1ccnc2cc(Cl)ccc12