Reaction Details
TargetSalicyl-AMP ligase / salicyl-S-ArCP synthetase
LigandBDBM50411239
Substrate/Competitorn/a
Meas. Tech.ChEMBL_423930 (CHEMBL911945)
Ki 2.3±n/a nM
Citation Somu, RVWilson, DJBennett, EMBoshoff, HICelia, LBeck, BJBarry, CEAldrich, CC Antitubercular nucleosides that inhibit siderophore biosynthesis: SAR of the glycosyl domain. J Med Chem49:7623-35 (2006) 
 
Salicyl-AMP ligase / salicyl-S-ArCP synthetase
Name:Salicyl-AMP ligase / salicyl-S-ArCP synthetase
Type:PROTEIN
Mol. Mass.:59275.32
Organism:Mycobacterium tuberculosis
Description:ChEMBL_423930
Residue:565
BDBM50411239
NameBDBM50411239
Synonyms:CHEMBL218023
TypeSmall organic molecule
Emp. Form.C18H20N6O7S
Mol. Mass.464.452
SMILESNc1ncnc2ncn([C@@H]3C[C@H](COS(=O)(=O)NC(=O)c4ccccc4O)[C@@H](O)[C@H]3O)c12