Reaction Details
Target7-dehydrocholesterol reductase
LigandBDBM50411320
Substrate/Competitorn/a
Meas. Tech.ChEMBL_430045 (CHEMBL918647)
IC50 30±n/a nM
Citation Burke, PJKalet, BTKoch, TH Antiestrogen binding site and estrogen receptor mediate uptake and distribution of 4-hydroxytamoxifen-targeted doxorubicin-formaldehyde conjugate in breast cancer cells. J Med Chem47:6509-18 (2004) 
 
7-dehydrocholesterol reductase
Name:7-dehydrocholesterol reductase
Type:PROTEIN
Mol. Mass.:54508.42
Organism:Homo sapiens (Human)
Description:ChEMBL_864350
Residue:475
BDBM50411320
NameBDBM50411320
Synonyms:CHEMBL222694
TypeSmall organic molecule
Emp. Form.C67H74N4O18
Mol. Mass.1223.3205
SMILESCC\C(=C(\c1ccc(O)cc1)c1ccc(OCCN(C)CCOCCOCCO\N=C\c2ccc(O)c(c2)C(=O)NCN[C@H]2C[C@H](O[C@H]3C[C@@](O)(Cc4c(O)c5C(=O)c6cccc(OC)c6C(=O)c5c(O)c34)C(=O)CO)O[C@@H](C)[C@H]2O)cc1)c1ccccc1