Reaction Details
TargetC3a anaphylatoxin chemotactic receptor
LigandBDBM50422988
Substrate/Competitorn/a
Meas. Tech.ChEMBL_438727 (CHEMBL889062)
IC50 63±n/a nM
Citation Denonne, FBinet, SBurton, MCollart, PDipesa, AGanguly, TGiannaras, AKumar, SLewis, TMaounis, FNicolas, JMMansley, TPasau, PPreda, DStebbins, KVolosov, AZou, D Discovery of new C3aR ligands. Part 1: arginine derivatives. Bioorg Med Chem Lett17:3258-61 (2007) 
 
C3a anaphylatoxin chemotactic receptor
Name:C3a anaphylatoxin chemotactic receptor
Type:PROTEIN
Mol. Mass.:53864.66
Organism:Homo sapiens (Human)
Description:ChEMBL_642034
Residue:482
BDBM50422988
NameBDBM50422988
Synonyms:CHEMBL230034
TypeSmall organic molecule
Emp. Form.C24H26N4O4
Mol. Mass.434.4876
SMILES[#7]\[#6](-[#7])=[#7]\[#6]-[#6]-[#6]-[#6@H](-[#7]-[#6](=O)-c1ccc(o1)-[#6](-c1ccccc1)-c1ccccc1)-[#6](-[#8])=O