Reaction Details
TargetGastrin/cholecystokinin type B receptor
LigandBDBM50411340
Substrate/Competitorn/a
Meas. Tech.ChEMBL_439007 (CHEMBL889353)
Ki 6.3±n/a nM
Citation McDonald, IMBlack, JWBuck, IMDunstone, DJGriffin, EPHarper, EAHull, RAKalindjian, SBLilley, EJLinney, IDPether, MJRoberts, SPShaxted, MESpencer, JSteel, KISykes, DAWalker, MKWatt, GFWright, LWright, PTXun, W Optimization of 1,3,4-benzotriazepine-based CCK(2) antagonists to obtain potent, orally active inhibitors of gastrin-mediated gastric acid secretion. J Med Chem50:3101-12 (2007) 
 
Gastrin/cholecystokinin type B receptor
Name:Gastrin/cholecystokinin type B receptor
Type:Enzyme Catalytic Domain
Mol. Mass.:48544.19
Organism:Dog
Description:Cholecystokinin B 0 Dog::P30552
Residue:453
BDBM50411340
NameBDBM50411340
Synonyms:CHEMBL387948
TypeSmall organic molecule
Emp. Form.C31H36N4O5
Mol. Mass.544.6413
SMILESOC(=O)Cc1cccc(NC(=O)CN2N=C(C3CCCCC3)c3ccccc3N(CC(=O)C3CCCC3)C2=O)c1