Reaction Details
TargetGastrin/cholecystokinin type B receptor
LigandBDBM50411343
Substrate/Competitorn/a
Meas. Tech.ChEMBL_439002 (CHEMBL889348)
Ki 1.9±n/a nM
Citation McDonald, IMBlack, JWBuck, IMDunstone, DJGriffin, EPHarper, EAHull, RAKalindjian, SBLilley, EJLinney, IDPether, MJRoberts, SPShaxted, MESpencer, JSteel, KISykes, DAWalker, MKWatt, GFWright, LWright, PTXun, W Optimization of 1,3,4-benzotriazepine-based CCK(2) antagonists to obtain potent, orally active inhibitors of gastrin-mediated gastric acid secretion. J Med Chem50:3101-12 (2007) 
 
Gastrin/cholecystokinin type B receptor
Name:Gastrin/cholecystokinin type B receptor
Type:G Protein-Coupled Receptor (GPCR)
Mol. Mass.:48445.79
Organism:Homo sapiens (Human)
Description:Stable expression of human CCK-2 receptors in HEK 293 cells.
Residue:447
BDBM50411343
NameBDBM50411343
Synonyms:CHEMBL226675
TypeSmall organic molecule
Emp. Form.C31H38N4O5
Mol. Mass.546.6572
SMILESCC(C)(C)C(=O)CN1c2ccccc2C(=NN(CC(=O)Nc2cccc(CCC(O)=O)c2)C1=O)C1CCCCC1