Reaction Details
TargetGastrin/cholecystokinin type B receptor
LigandBDBM50002896
Substrate/Competitorn/a
Meas. Tech.ChEMBL_439002 (CHEMBL889348)
Ki 4.3±n/a nM
Citation McDonald, IMBlack, JWBuck, IMDunstone, DJGriffin, EPHarper, EAHull, RAKalindjian, SBLilley, EJLinney, IDPether, MJRoberts, SPShaxted, MESpencer, JSteel, KISykes, DAWalker, MKWatt, GFWright, LWright, PTXun, W Optimization of 1,3,4-benzotriazepine-based CCK(2) antagonists to obtain potent, orally active inhibitors of gastrin-mediated gastric acid secretion. J Med Chem50:3101-12 (2007) 
 
Gastrin/cholecystokinin type B receptor
Name:Gastrin/cholecystokinin type B receptor
Type:G Protein-Coupled Receptor (GPCR)
Mol. Mass.:48445.79
Organism:Homo sapiens (Human)
Description:Stable expression of human CCK-2 receptors in HEK 293 cells.
Residue:447
BDBM50002896
NameBDBM50002896
Synonyms:CHEMBL374389
TypeSmall organic molecule
Emp. Form.C30H36N4O7S
Mol. Mass.596.694
SMILESCC(C)(C)C(=O)CN1c2ccccc2C(=NN(CC(=O)Nc2cccc(c2)S(=O)(=O)CC(O)=O)C1=O)C1CCCCC1