Reaction Details
TargetCholecystokinin receptor type A
LigandBDBM50411344
Substrate/Competitorn/a
Meas. Tech.ChEMBL_439005 (CHEMBL889351)
Ki 550±n/a nM
Citation McDonald, IMBlack, JWBuck, IMDunstone, DJGriffin, EPHarper, EAHull, RAKalindjian, SBLilley, EJLinney, IDPether, MJRoberts, SPShaxted, MESpencer, JSteel, KISykes, DAWalker, MKWatt, GFWright, LWright, PTXun, W Optimization of 1,3,4-benzotriazepine-based CCK(2) antagonists to obtain potent, orally active inhibitors of gastrin-mediated gastric acid secretion. J Med Chem50:3101-12 (2007) 
 
Cholecystokinin receptor type A
Name:Cholecystokinin receptor type A
Type:G Protein-Coupled Receptor (GPCR)
Mol. Mass.:47859.34
Organism:Homo sapiens (Human)
Description:Stable expression of human CCK-1 receptors in HEK 293 cells.
Residue:428
BDBM50411344
NameBDBM50411344
Synonyms:CHEMBL389711
TypeSmall organic molecule
Emp. Form.C32H37N5O5
Mol. Mass.571.6667
SMILESCC(C)(C)C(=O)CN1c2ccccc2C(=NN(CC(=O)Nc2ccc3ccn(CC(O)=O)c3c2)C1=O)C1CCCCC1