Reaction Details
TargetParathyroid hormone/parathyroid hormone-related peptide receptor
LigandBDBM50002906
Substrate/Competitorn/a
Meas. Tech.ChEMBL_446293 (CHEMBL895396)
Ki 112±n/a nM
Citation McDonald, IMAustin, CBuck, IMDunstone, DJGaffen, JGriffin, EHarper, EAHull, RAKalindjian, SBLinney, IDLow, CMPatel, DPether, MJRaynor, MRoberts, SPShaxted, MESpencer, JSteel, KISykes, DAWright, PTXun, W Discovery and characterization of novel, potent, non-peptide parathyroid hormone-1 receptor antagonists. J Med Chem50:4789-92 (2007) 
 
Parathyroid hormone/parathyroid hormone-related peptide receptor
Name:Parathyroid hormone/parathyroid hormone-related peptide receptor
Type:Enzyme Catalytic Domain
Mol. Mass.:66370.95
Organism:Homo sapiens (Human)
Description:PARATHYROID HT1 0 HUMAN::Q03431
Residue:593
BDBM50002906
NameBDBM50002906
Synonyms:CHEMBL395054
TypeSmall organic molecule
Emp. Form.C33H39N5O2
Mol. Mass.537.6951
SMILESCC(C)C(N)C(=O)Nc1ccc(cc1)N1c2cc(C)ccc2C(=NN(Cc2ccccc2)C1=O)C1CCCCC1