Reaction Details
TargetMitogen-activated protein kinase 14
LigandBDBM50241256
Substrate/Competitorn/a
Meas. Tech.ChEMBL_446770 (CHEMBL897069)
IC50>15848.93±n/a nM
Citation Angell, RMAtkinson, FLBrown, MJChuang, TTChristopher, JACichy-Knight, MDunn, AKHightower, KEMalkakorpi, SMusgrave, JRNeu, MRowland, PShea, RLSmith, JLSomers, DOThomas, SAThompson, GWang, R N-(3-Cyano-4,5,6,7-tetrahydro-1-benzothien-2-yl)amides as potent, selective, inhibitors of JNK2 and JNK3. Bioorg Med Chem Lett17:1296-301 (2007) 
 
Mitogen-activated protein kinase 14
Name:Mitogen-activated protein kinase 14
Type:Serine/threonine-protein kinase
Mol. Mass.:41286.76
Organism:Homo sapiens (Human)
Description:Q16539
Residue:360
BDBM50241256
NameBDBM50241256
Synonyms:CHEMBL233000 | N-(3-cyano-4,5,6,7-tetrahydrobenzo[b]thiophen-2-yl)benzamide
TypeSmall organic molecule
Emp. Form.C16H14N2OS
Mol. Mass.282.36
SMILESO=C(Nc1sc2CCCCc2c1C#N)c1ccccc1