Reaction Details
TargetMitogen-activated protein kinase 1
LigandBDBM50411415
Substrate/Competitorn/a
Meas. Tech.ChEMBL_446771 (CHEMBL897070)
IC50>10000±n/a nM
Citation Angell, RMAtkinson, FLBrown, MJChuang, TTChristopher, JACichy-Knight, MDunn, AKHightower, KEMalkakorpi, SMusgrave, JRNeu, MRowland, PShea, RLSmith, JLSomers, DOThomas, SAThompson, GWang, R N-(3-Cyano-4,5,6,7-tetrahydro-1-benzothien-2-yl)amides as potent, selective, inhibitors of JNK2 and JNK3. Bioorg Med Chem Lett17:1296-301 (2007) 
 
Mitogen-activated protein kinase 1
Name:Mitogen-activated protein kinase 1
Type:Ser/Thr Protein Kinase
Mol. Mass.:41392.76
Organism:Homo sapiens (Human)
Description:P28482
Residue:360
BDBM50411415
NameBDBM50411415
Synonyms:CHEMBL232599
TypeSmall organic molecule
Emp. Form.C27H28N4O2S
Mol. Mass.472.602
SMILESO=C(CCN1CCCCC1)N1CCc2c(C1)sc(NC(=O)c1cccc3ccccc13)c2C#N