Reaction Details
TargetMitogen-activated protein kinase 1
LigandBDBM50411417
Substrate/Competitorn/a
Meas. Tech.ChEMBL_446771 (CHEMBL897070)
IC50>10000±n/a nM
Citation Angell, RMAtkinson, FLBrown, MJChuang, TTChristopher, JACichy-Knight, MDunn, AKHightower, KEMalkakorpi, SMusgrave, JRNeu, MRowland, PShea, RLSmith, JLSomers, DOThomas, SAThompson, GWang, R N-(3-Cyano-4,5,6,7-tetrahydro-1-benzothien-2-yl)amides as potent, selective, inhibitors of JNK2 and JNK3. Bioorg Med Chem Lett17:1296-301 (2007) 
 
Mitogen-activated protein kinase 1
Name:Mitogen-activated protein kinase 1
Type:Ser/Thr Protein Kinase
Mol. Mass.:41392.76
Organism:Homo sapiens (Human)
Description:P28482
Residue:360
BDBM50411417
NameBDBM50411417
Synonyms:CHEMBL391656
TypeSmall organic molecule
Emp. Form.C25H20N4OS
Mol. Mass.424.517
SMILESO=C(Nc1sc2N(Cc3cccnc3)CCCc2c1C#N)c1cccc2ccccc12