Reaction Details
TargetMitogen-activated protein kinase 8
LigandBDBM50411407
Substrate/Competitorn/a
Meas. Tech.ChEMBL_446768 (CHEMBL897067)
IC50>10000±n/a nM
Citation Angell, RMAtkinson, FLBrown, MJChuang, TTChristopher, JACichy-Knight, MDunn, AKHightower, KEMalkakorpi, SMusgrave, JRNeu, MRowland, PShea, RLSmith, JLSomers, DOThomas, SAThompson, GWang, R N-(3-Cyano-4,5,6,7-tetrahydro-1-benzothien-2-yl)amides as potent, selective, inhibitors of JNK2 and JNK3. Bioorg Med Chem Lett17:1296-301 (2007) 
 
Mitogen-activated protein kinase 8
Name:Mitogen-activated protein kinase 8
Type:Enzyme
Mol. Mass.:48297.57
Organism:Homo sapiens (Human)
Description:JNK-1 was purchased from Upstate Cell Signaling Solutions (formerly Upstate Biotechnology).
Residue:427
BDBM50411407
NameBDBM50411407
Synonyms:CHEMBL232610
TypeSmall organic molecule
Emp. Form.C23H17N5O2S
Mol. Mass.427.478
SMILESO=C(Nc1sc2N(CCCc2c1C#N)C(=O)c1ccn[nH]1)c1cccc2ccccc12