Reaction Details
TargetMitogen-activated protein kinase 10
LigandBDBM50411415
Substrate/Competitorn/a
Meas. Tech.ChEMBL_446769 (CHEMBL897068)
IC50 3162.28±n/a nM
Citation Angell, RMAtkinson, FLBrown, MJChuang, TTChristopher, JACichy-Knight, MDunn, AKHightower, KEMalkakorpi, SMusgrave, JRNeu, MRowland, PShea, RLSmith, JLSomers, DOThomas, SAThompson, GWang, R N-(3-Cyano-4,5,6,7-tetrahydro-1-benzothien-2-yl)amides as potent, selective, inhibitors of JNK2 and JNK3. Bioorg Med Chem Lett17:1296-301 (2007) 
 
Mitogen-activated protein kinase 10
Name:Mitogen-activated protein kinase 10
Type:Enzyme
Mol. Mass.:52586.89
Organism:Homo sapiens (Human)
Description:n/a
Residue:464
BDBM50411415
NameBDBM50411415
Synonyms:CHEMBL232599
TypeSmall organic molecule
Emp. Form.C27H28N4O2S
Mol. Mass.472.602
SMILESO=C(CCN1CCCCC1)N1CCc2c(C1)sc(NC(=O)c1cccc3ccccc13)c2C#N