Reaction Details
TargetThyroid hormone receptor beta
LigandBDBM18922
Substrate/Competitorn/a
Meas. Tech.ChEMBL_447974 (CHEMBL898226)
IC50 0.933±n/a nM
Citation Liu, HGramatica, P QSAR study of selective ligands for the thyroid hormone receptor beta. Bioorg Med Chem15:5251-61 (2007) 
 
Thyroid hormone receptor beta
Name:Thyroid hormone receptor beta
Type:Receptor
Mol. Mass.:52793.62
Organism:Homo sapiens (Human)
Description:Recombinant hThR was obtained from nuclear extracts from SF9 cells infected with baculovirus vectors encoding for ThRbeta 1.
Residue:461
BDBM18922
NameBDBM18922
Synonyms:2-(3,5-dichloro-4-{4-hydroxy-3-[3-(trifluoromethyl)phenyl]phenoxy}phenyl)acetic acid | 4-hydroxy thyromimetic, 9c
TypeSmall organic molecule
Emp. Form.C21H13Cl2F3O4
Mol. Mass.457.227
SMILESOC(=O)Cc1cc(Cl)c(Oc2ccc(O)c(c2)-c2cccc(c2)C(F)(F)F)c(Cl)c1