Reaction Details
TargetThyroid hormone receptor beta
LigandBDBM18928
Substrate/Competitorn/a
Meas. Tech.ChEMBL_447974 (CHEMBL898226)
IC50 3.39±n/a nM
Citation Liu, HGramatica, P QSAR study of selective ligands for the thyroid hormone receptor beta. Bioorg Med Chem15:5251-61 (2007) 
 
Thyroid hormone receptor beta
Name:Thyroid hormone receptor beta
Type:Receptor
Mol. Mass.:52793.62
Organism:Homo sapiens (Human)
Description:Recombinant hThR was obtained from nuclear extracts from SF9 cells infected with baculovirus vectors encoding for ThRbeta 1.
Residue:461
BDBM18928
NameBDBM18928
Synonyms:2-(3,5-dichloro-4-{4-hydroxy-3-[3-(trifluoromethoxy)phenyl]phenoxy}phenyl)acetic acid | 4-hydroxy thyromimetic, 9j
TypeSmall organic molecule
Emp. Form.C21H13Cl2F3O5
Mol. Mass.473.226
SMILESOC(=O)Cc1cc(Cl)c(Oc2ccc(O)c(c2)-c2cccc(OC(F)(F)F)c2)c(Cl)c1