Reaction Details
TargetThyroid hormone receptor beta
LigandBDBM18937
Substrate/Competitorn/a
Meas. Tech.ChEMBL_447974 (CHEMBL898226)
IC50 7.76±n/a nM
Citation Liu, HGramatica, P QSAR study of selective ligands for the thyroid hormone receptor beta. Bioorg Med Chem15:5251-61 (2007) 
 
Thyroid hormone receptor beta
Name:Thyroid hormone receptor beta
Type:Receptor
Mol. Mass.:52793.62
Organism:Homo sapiens (Human)
Description:Recombinant hThR was obtained from nuclear extracts from SF9 cells infected with baculovirus vectors encoding for ThRbeta 1.
Residue:461
BDBM18937
NameBDBM18937
Synonyms:2-[3,5-dichloro-4-(3-cyclohexyl-4-hydroxyphenoxy)phenyl]acetic acid | 4-hydroxy thyromimetic, 9s
TypeSmall organic molecule
Emp. Form.C20H20Cl2O4
Mol. Mass.395.276
SMILESOC(=O)Cc1cc(Cl)c(Oc2ccc(O)c(c2)C2CCCCC2)c(Cl)c1