Reaction Details
TargetThyroid hormone receptor beta
LigandBDBM50123044
Substrate/Competitorn/a
Meas. Tech.ChEMBL_447974 (CHEMBL898226)
IC50 0.112±n/a nM
Citation Liu, HGramatica, P QSAR study of selective ligands for the thyroid hormone receptor beta. Bioorg Med Chem15:5251-61 (2007) 
 
Thyroid hormone receptor beta
Name:Thyroid hormone receptor beta
Type:Receptor
Mol. Mass.:52793.62
Organism:Homo sapiens (Human)
Description:Recombinant hThR was obtained from nuclear extracts from SF9 cells infected with baculovirus vectors encoding for ThRbeta 1.
Residue:461
BDBM50123044
NameBDBM50123044
Synonyms:5-(2,6-dichloro-4-(3,5-dioxo-4,5-dihydro-1,2,4-triazin-2(3H)-yl)phenoxy)-N-(6,6-dimethylbicyclo[3.1.1]heptan-2-yl)-2-hydroxybenzamide CHEMBL124205
TypeSmall organic molecule
Emp. Form.C25H24Cl2N4O5
Mol. Mass.531.388
SMILESCC1(C)C2CC1C(CC2)NC(=O)c1cc(Oc2c(Cl)cc(cc2Cl)-n2ncc(=O)[nH]c2=O)ccc1O