Reaction Details
TargetGlucocorticoid receptor
LigandBDBM50411488
Substrate/Competitorn/a
Meas. Tech.ChEMBL_452406 (CHEMBL902642)
IC50 3.80±n/a nM
Citation Biggadike, KBoudjelal, MClackers, MCoe, DMDemaine, DAHardy, GWHumphreys, DInglis, GGJohnston, MJJones, HTHouse, DLoiseau, RNeedham, DSkone, PAUings, IVeitch, GWeingarten, GGMcLay, IMMacdonald, SJ Nonsteroidal glucocorticoid agonists: tetrahydronaphthalenes with alternative steroidal A-ring mimetics possessing dissociated (transrepression/transactivation) efficacy selectivity. J Med Chem50:6519-34 (2007) 
 
Glucocorticoid receptor
Name:Glucocorticoid receptor
Type:Enzyme
Mol. Mass.:85656.87
Organism:Homo sapiens (Human)
Description:P04150
Residue:777
BDBM50411488
NameBDBM50411488
Synonyms:CHEMBL236018
TypeSmall organic molecule
Emp. Form.C26H27F3N2O
Mol. Mass.440.5006
SMILESCCC1(CC(O)(Cc2cc3c(C)cc(cc3[nH]2)C#N)C(F)(F)F)CCCc2ccccc12