Reaction Details
TargetGlucocorticoid receptor
LigandBDBM50411489
Substrate/Competitorn/a
Meas. Tech.ChEMBL_452406 (CHEMBL902642)
IC50 1.95±n/a nM
Citation Biggadike, KBoudjelal, MClackers, MCoe, DMDemaine, DAHardy, GWHumphreys, DInglis, GGJohnston, MJJones, HTHouse, DLoiseau, RNeedham, DSkone, PAUings, IVeitch, GWeingarten, GGMcLay, IMMacdonald, SJ Nonsteroidal glucocorticoid agonists: tetrahydronaphthalenes with alternative steroidal A-ring mimetics possessing dissociated (transrepression/transactivation) efficacy selectivity. J Med Chem50:6519-34 (2007) 
 
Glucocorticoid receptor
Name:Glucocorticoid receptor
Type:Enzyme
Mol. Mass.:85656.87
Organism:Homo sapiens (Human)
Description:P04150
Residue:777
BDBM50411489
NameBDBM50411489
Synonyms:CHEMBL238147
TypeSmall organic molecule
Emp. Form.C26H29F3N2O
Mol. Mass.442.5165
SMILESCCC1(CC(O)(CNc2cccc3nc(C)ccc23)C(F)(F)F)CCCc2ccccc12