Reaction Details
TargetATP-dependent translocase ABCB1
LigandBDBM50017712
Substrate/Competitorn/a
Meas. Tech.ChEMBL_458146 (CHEMBL925479)
IC50 3236±n/a nM
Citation Müller, HKlinkhammer, WGlobisch, CKassack, MUPajeva, IKWiese, M New functional assay of P-glycoprotein activity using Hoechst 33342. Bioorg Med Chem15:7470-9 (2007) 
 
ATP-dependent translocase ABCB1
Name:ATP-dependent translocase ABCB1
Type:Protein
Mol. Mass.:141503.50
Organism:Homo sapiens (Human)
Description:P08183
Residue:1280
BDBM50017712
NameBDBM50017712
Synonyms:(-)-reserpine 3,4,5-trimethoxybenzoyl methyl reserpate CHEMBL772 RESERPINE Serpalan methyl (3beta,16beta,17alpha,18beta,20alpha)-11,17-dimethoxy-18-[(3,4,5-trimethoxybenzoyl)oxy]yohimban-16-carboxylate
TypeSmall organic molecule
Emp. Form.C33H40N2O9
Mol. Mass.608.6787
SMILESCO[C@H]1[C@@H](C[C@@H]2CN3CCc4c([nH]c5cc(OC)ccc45)[C@H]3C[C@@H]2[C@@H]1C(=O)OC)OC(=O)c1cc(OC)c(OC)c(OC)c1