Reaction Details
TargetThyroid hormone receptor beta
LigandBDBM50178974
Substrate/Competitorn/a
Meas. Tech.ChEMBL_459043 (CHEMBL925135)
IC50 0.282±n/a nM
Citation Valadares, NFCastilho, MSPolikarpov, IGarratt, RC 2D QSAR studies on thyroid hormone receptor ligands. Bioorg Med Chem15:4609-17 (2007) 
 
Thyroid hormone receptor beta
Name:Thyroid hormone receptor beta
Type:Receptor
Mol. Mass.:52793.62
Organism:Homo sapiens (Human)
Description:Recombinant hThR was obtained from nuclear extracts from SF9 cells infected with baculovirus vectors encoding for ThRbeta 1.
Residue:461
BDBM50178974
NameBDBM50178974
Synonyms:4,6-dibromo-5-(4-hydroxy-3-isopropylphenoxy)-1H-indole-2-carboxylic acid | CHEMBL425939
TypeSmall organic molecule
Emp. Form.C18H15Br2NO4
Mol. Mass.469.124
SMILESCC(C)c1cc(Oc2c(Br)cc3[nH]c(cc3c2Br)C(O)=O)ccc1O