Reaction Details
TargetThyroid hormone receptor alpha
LigandBDBM50178971
Substrate/Competitorn/a
Meas. Tech.ChEMBL_459042 (CHEMBL925134)
IC50 0.24±n/a nM
Citation Valadares, NFCastilho, MSPolikarpov, IGarratt, RC 2D QSAR studies on thyroid hormone receptor ligands. Bioorg Med Chem15:4609-17 (2007) 
 
Thyroid hormone receptor alpha
Name:Thyroid hormone receptor alpha
Type:Receptor
Mol. Mass.:54818.00
Organism:Homo sapiens (Human)
Description:Recombinant hThR was obtained from nuclear extracts from SF9 cells infected with baculovirus vectors encoding for ThRalpha 1.
Residue:490
BDBM50178971
NameBDBM50178971
Synonyms:(R)-2-Amino-3-[4-(4-hydroxy-3-iodo-phenoxy)-3,5-diiodo-phenyl]-propionic acid 2-Amino-3-[4-(4-hydroxy-3-iodo-phenoxy)-3,5-diiodo-phenyl]-propionic acid Detrothyronine
TypeSmall organic molecule
Emp. Form.C15H12I3NO4
Mol. Mass.650.9735
SMILESN[C@H](Cc1cc(I)c(Oc2ccc(O)c(I)c2)c(I)c1)C(O)=O