Reaction Details
TargetThyroid hormone receptor beta
LigandBDBM18863
Substrate/Competitorn/a
Meas. Tech.ChEMBL_459043 (CHEMBL925135)
IC50 0.11±n/a nM
Citation Valadares, NFCastilho, MSPolikarpov, IGarratt, RC 2D QSAR studies on thyroid hormone receptor ligands. Bioorg Med Chem15:4609-17 (2007) 
 
Thyroid hormone receptor beta
Name:Thyroid hormone receptor beta
Type:Receptor
Mol. Mass.:52793.62
Organism:Homo sapiens (Human)
Description:Recombinant hThR was obtained from nuclear extracts from SF9 cells infected with baculovirus vectors encoding for ThRbeta 1.
Residue:461
BDBM18863
NameBDBM18863
Synonyms:(2R)-2-amino-3-{4-[4-hydroxy-3-(propan-2-yl)phenoxy]-3,5-diiodophenyl}propanoic acid | diiodo isopropyl thyronine, 4
TypeSmall organic molecule
Emp. Form.C18H19I2NO4
Mol. Mass.567.1567
SMILESCC(C)c1cc(Oc2c(I)cc(C[C@@H](N)C(O)=O)cc2I)ccc1O