Reaction Details
TargetThyroid hormone receptor beta
LigandBDBM18954
Substrate/Competitorn/a
Meas. Tech.ChEMBL_459043 (CHEMBL925135)
IC50 0.468±n/a nM
Citation Valadares, NFCastilho, MSPolikarpov, IGarratt, RC 2D QSAR studies on thyroid hormone receptor ligands. Bioorg Med Chem15:4609-17 (2007) 
 
Thyroid hormone receptor beta
Name:Thyroid hormone receptor beta
Type:Receptor
Mol. Mass.:52793.62
Organism:Homo sapiens (Human)
Description:Recombinant hThR was obtained from nuclear extracts from SF9 cells infected with baculovirus vectors encoding for ThRbeta 1.
Residue:461
BDBM18954
NameBDBM18954
Synonyms:2-(3,5-dibromo-4-{3-[(2,2-diphenylethyl)carbamoyl]-4-hydroxyphenoxy}phenyl)acetic acid | 4-hydroxy thyromimetic, 15i
TypeSmall organic molecule
Emp. Form.C29H23Br2NO5
Mol. Mass.625.305
SMILESOC(=O)Cc1cc(Br)c(Oc2ccc(O)c(c2)C(=O)NCC(c2ccccc2)c2ccccc2)c(Br)c1