Reaction Details
TargetD(3) dopamine receptor
LigandBDBM50411648
Substrate/Competitorn/a
Meas. Tech.ChEMBL_465003 (CHEMBL948180)
Ki 50.12±n/a nM
Citation Micheli, FBonanomi, GBraggio, SCapelli, AMCelestini, PDamiani, FDi Fabio, RDonati, DGagliardi, SGentile, GHamprecht, DPetrone, MRadaelli, STedesco, GTerreni, SWorby, AHeidbreder, C New fused benzazepine as selective D3 receptor antagonists. Synthesis and biological evaluation. Part one: [h]-fused tricyclic systems. Bioorg Med Chem Lett18:901-7 (2008) 
 
D(3) dopamine receptor
Name:D(3) dopamine receptor
Type:n/a
Mol. Mass.:44243.43
Organism:Homo sapiens (Human)
Description:n/a
Residue:400
BDBM50411648
NameBDBM50411648
Synonyms:CHEMBL273165
TypeSmall organic molecule
Emp. Form.C29H31BrN6OS
Mol. Mass.591.565
SMILESCC(CCSc1nnc(-c2cccc3nc(C)ccc23)n1C)N1CCc2cc3nc(C)oc3c(Br)c2CC1