Reaction Details
TargetPotassium voltage-gated channel subfamily H member 2
LigandBDBM50411713
Substrate/Competitorn/a
Meas. Tech.ChEMBL_465006 (CHEMBL948183)
IC50 19952.62±n/a nM
Citation Micheli, FBonanomi, GBraggio, SCapelli, AMCelestini, PDamiani, FDi Fabio, RDonati, DGagliardi, SGentile, GHamprecht, DPetrone, MRadaelli, STedesco, GTerreni, SWorby, AHeidbreder, C New fused benzazepine as selective D3 receptor antagonists. Synthesis and biological evaluation. Part one: [h]-fused tricyclic systems. Bioorg Med Chem Lett18:901-7 (2008) 
 
Potassium voltage-gated channel subfamily H member 2
Name:Potassium voltage-gated channel subfamily H member 2
Type:Multi-pass membrane protein
Mol. Mass.:126672.65
Organism:Homo sapiens (Human)
Description:Q12809
Residue:1159
BDBM50411713
NameBDBM50411713
Synonyms:CHEMBL255620
TypeSmall organic molecule
Emp. Form.C29H33N7OS
Mol. Mass.527.684
SMILESCN(C)c1nc2cc3CCN(CCCSc4nnc(-c5cccc6nc(C)ccc56)n4C)CCc3cc2o1