Reaction Details
TargetD(2) dopamine receptor
LigandBDBM50411713
Substrate/Competitorn/a
Meas. Tech.ChEMBL_465004 (CHEMBL948181)
Ki>501.19±n/a nM
Citation Micheli, FBonanomi, GBraggio, SCapelli, AMCelestini, PDamiani, FDi Fabio, RDonati, DGagliardi, SGentile, GHamprecht, DPetrone, MRadaelli, STedesco, GTerreni, SWorby, AHeidbreder, C New fused benzazepine as selective D3 receptor antagonists. Synthesis and biological evaluation. Part one: [h]-fused tricyclic systems. Bioorg Med Chem Lett18:901-7 (2008) 
 
D(2) dopamine receptor
Name:D(2) dopamine receptor
Type:Cell-surface receptors
Mol. Mass.:50647.10
Organism:Homo sapiens (Human)
Description:P14416
Residue:443
BDBM50411713
NameBDBM50411713
Synonyms:CHEMBL255620
TypeSmall organic molecule
Emp. Form.C29H33N7OS
Mol. Mass.527.684
SMILESCN(C)c1nc2cc3CCN(CCCSc4nnc(-c5cccc6nc(C)ccc56)n4C)CCc3cc2o1