Reaction Details
TargetD(2) dopamine receptor
LigandBDBM50411706
Substrate/Competitorn/a
Meas. Tech.ChEMBL_465004 (CHEMBL948181)
Ki>630.96±n/a nM
Citation Micheli, FBonanomi, GBraggio, SCapelli, AMCelestini, PDamiani, FDi Fabio, RDonati, DGagliardi, SGentile, GHamprecht, DPetrone, MRadaelli, STedesco, GTerreni, SWorby, AHeidbreder, C New fused benzazepine as selective D3 receptor antagonists. Synthesis and biological evaluation. Part one: [h]-fused tricyclic systems. Bioorg Med Chem Lett18:901-7 (2008) 
 
D(2) dopamine receptor
Name:D(2) dopamine receptor
Type:Cell-surface receptors
Mol. Mass.:50647.10
Organism:Homo sapiens (Human)
Description:P14416
Residue:443
BDBM50411706
NameBDBM50411706
Synonyms:CHEMBL255826
TypeSmall organic molecule
Emp. Form.C32H37N7OS
Mol. Mass.567.747
SMILESCc1ccc2c(cccc2n1)-c1nnc(SCCCN2CCc3cc4nc(oc4cc3CC2)N2CCCCC2)n1C