Reaction Details
TargetD(3) dopamine receptor
LigandBDBM50411718
Substrate/Competitorn/a
Meas. Tech.ChEMBL_465003 (CHEMBL948180)
Ki 12.59±n/a nM
Citation Micheli, FBonanomi, GBraggio, SCapelli, AMCelestini, PDamiani, FDi Fabio, RDonati, DGagliardi, SGentile, GHamprecht, DPetrone, MRadaelli, STedesco, GTerreni, SWorby, AHeidbreder, C New fused benzazepine as selective D3 receptor antagonists. Synthesis and biological evaluation. Part one: [h]-fused tricyclic systems. Bioorg Med Chem Lett18:901-7 (2008) 
 
D(3) dopamine receptor
Name:D(3) dopamine receptor
Type:n/a
Mol. Mass.:44243.43
Organism:Homo sapiens (Human)
Description:n/a
Residue:400
BDBM50411718
NameBDBM50411718
Synonyms:CHEMBL272545
TypeSmall organic molecule
Emp. Form.C29H32N6OS
Mol. Mass.512.669
SMILESCCc1nc2cc3CCN(CCCSc4nnc(-c5cccc6nc(C)ccc56)n4C)CCc3cc2o1