Reaction Details
TargetD(3) dopamine receptor
LigandBDBM50411717
Substrate/Competitorn/a
Meas. Tech.ChEMBL_465003 (CHEMBL948180)
Ki 50.12±n/a nM
Citation Micheli, FBonanomi, GBraggio, SCapelli, AMCelestini, PDamiani, FDi Fabio, RDonati, DGagliardi, SGentile, GHamprecht, DPetrone, MRadaelli, STedesco, GTerreni, SWorby, AHeidbreder, C New fused benzazepine as selective D3 receptor antagonists. Synthesis and biological evaluation. Part one: [h]-fused tricyclic systems. Bioorg Med Chem Lett18:901-7 (2008) 
 
D(3) dopamine receptor
Name:D(3) dopamine receptor
Type:n/a
Mol. Mass.:44243.43
Organism:Homo sapiens (Human)
Description:n/a
Residue:400
BDBM50411717
NameBDBM50411717
Synonyms:CHEMBL272695
TypeSmall organic molecule
Emp. Form.C30H32N6OS
Mol. Mass.524.68
SMILESCc1ccc2c(cccc2n1)-c1nnc(SCCCN2CCc3cc4nc(oc4cc3CC2)C2CC2)n1C