Reaction Details
TargetNeprilysin
LigandBDBM50411605
Substrate/Competitorn/a
Meas. Tech.ChEMBL_465246 (CHEMBL933040)
Ki 27±n/a nM
Citation Deaton, DNGao, ENGraham, KPGross, JWMiller, ABStrelow, JM Thiol-based angiotensin-converting enzyme 2 inhibitors: P1 modifications for the exploration of the S1 subsite. Bioorg Med Chem Lett18:732-7 (2008) 
 
Neprilysin
Name:Neprilysin
Type:Enzyme
Mol. Mass.:85505.38
Organism:Homo sapiens (Human)
Description:P08473
Residue:750
BDBM50411605
NameBDBM50411605
Synonyms:CHEMBL252391
TypeSmall organic molecule
Emp. Form.C21H25NO3S
Mol. Mass.371.493
SMILESCC[C@@H](C)[C@H](S)C(=O)N[C@@H](Cc1ccc(cc1)-c1ccccc1)C(O)=O