Reaction Details
TargetAngiotensin-converting enzyme 2
LigandBDBM50411727
Substrate/Competitorn/a
Meas. Tech.ChEMBL_465244 (CHEMBL933038)
Ki 65±n/a nM
Citation Deaton, DNGao, ENGraham, KPGross, JWMiller, ABStrelow, JM Thiol-based angiotensin-converting enzyme 2 inhibitors: P1 modifications for the exploration of the S1 subsite. Bioorg Med Chem Lett18:732-7 (2008) 
 
Angiotensin-converting enzyme 2
Name:Angiotensin-converting enzyme 2
Type:Enzyme
Mol. Mass.:92448.86
Organism:Homo sapiens (Human)
Description:n/a
Residue:805
BDBM50411727
NameBDBM50411727
Synonyms:CHEMBL257026
TypeSmall organic molecule
Emp. Form.C23H27NO3S
Mol. Mass.397.53
SMILESOC(=O)[C@H](Cc1ccc(cc1)-c1ccccc1)NC(=O)[C@@H](S)C1CCCCC1