Reaction Details
TargetNeprilysin
LigandBDBM50411734
Substrate/Competitorn/a
Meas. Tech.ChEMBL_465246 (CHEMBL933040)
Ki 23±n/a nM
Citation Deaton, DNGao, ENGraham, KPGross, JWMiller, ABStrelow, JM Thiol-based angiotensin-converting enzyme 2 inhibitors: P1 modifications for the exploration of the S1 subsite. Bioorg Med Chem Lett18:732-7 (2008) 
 
Neprilysin
Name:Neprilysin
Type:Enzyme
Mol. Mass.:85505.38
Organism:Homo sapiens (Human)
Description:P08473
Residue:750
BDBM50411734
NameBDBM50411734
Synonyms:CHEMBL257727
TypeSmall organic molecule
Emp. Form.C18H19NO3S
Mol. Mass.329.413
SMILESC[C@H](S)C(=O)N[C@@H](Cc1ccc(cc1)-c1ccccc1)C(O)=O