Reaction Details
TargetC-C chemokine receptor type 8
LigandBDBM50423493
Substrate/Competitorn/a
Meas. Tech.ChEMBL_465785 (CHEMBL948147)
IC50 27±n/a nM
Citation Shamovsky, IConnolly, SDavid, LIvanova, SNordén, BSpringthorpe, BUrbahns, K Overcoming undesirable HERG potency of chemokine receptor antagonists using baseline lipophilicity relationships. J Med Chem51:1162-78 (2008) 
 
C-C chemokine receptor type 8
Name:C-C chemokine receptor type 8
Type:PROTEIN
Mol. Mass.:40855.53
Organism:Homo sapiens (Human)
Description:ChEMBL_454278
Residue:355
BDBM50423493
NameBDBM50423493
Synonyms:CHEMBL411651
TypeSmall organic molecule
Emp. Form.C29H33N3O4
Mol. Mass.487.59
SMILESCOc1ccccc1Oc1cccc(CN2CCC3(CC2)CCN(CC3)C(=O)c2cccc[n+]2[O-])c1