Reaction Details
TargetHeparanase
LigandBDBM50165620
Substrate/Competitorn/a
Meas. Tech.ChEMBL_531583 (CHEMBL990587)
IC50 398.11±n/a nM
Citation Jalali-Heravi, MAsadollahi-Baboli, MShahbazikhah, P QSAR study of heparanase inhibitors activity using artificial neural networks and Levenberg-Marquardt algorithm. Eur J Med Chem43:548-56 (2008) 
 
Heparanase
Name:Heparanase
Type:PROTEIN
Mol. Mass.:61167.67
Organism:Homo sapiens (Human)
Description:ChEMBL_327900
Residue:543
BDBM50165620
NameBDBM50165620
Synonyms:2-(4-(5-(2-chloro-4-(3-(4-methoxyphenyl)acrylamido)phenyl)furan-2-yl)thiazol-2-yl)acetic acid [4-(5-{2-Chloro-4-[3-(4-methoxy-phenyl)-acryloylamino]-phenyl}-furan-2-yl)-thiazol-2-yl]-acetic acid
TypeSmall organic molecule
Emp. Form.C25H19ClN2O5S
Mol. Mass.494.947
SMILESCOc1ccc(\C=C\C(=O)Nc2ccc(-c3ccc(o3)-c3csc(CC(O)=O)n3)c(Cl)c2)cc1