Reaction Details
TargetHeparanase
LigandBDBM50147522
Substrate/Competitorn/a
Meas. Tech.ChEMBL_531583 (CHEMBL990587)
IC50 398.11±n/a nM
Citation Jalali-Heravi, MAsadollahi-Baboli, MShahbazikhah, P QSAR study of heparanase inhibitors activity using artificial neural networks and Levenberg-Marquardt algorithm. Eur J Med Chem43:548-56 (2008) 
 
Heparanase
Name:Heparanase
Type:PROTEIN
Mol. Mass.:61167.67
Organism:Homo sapiens (Human)
Description:ChEMBL_327900
Residue:543
BDBM50147522
NameBDBM50147522
Synonyms:2-(4-(butylamino)-3-(5-phenylbenzo[d]oxazol-2-yl)phenyl)-1,3-dioxoisoindoline-5-carboxylic acid CHEMBL321840
TypeSmall organic molecule
Emp. Form.C32H25N3O5
Mol. Mass.531.558
SMILESCCCCNc1ccc(cc1-c1nc2cc(ccc2o1)-c1ccccc1)N1C(=O)c2ccc(cc2C1=O)C(O)=O