Reaction Details
TargetHeparanase
LigandBDBM50147546
Substrate/Competitorn/a
Meas. Tech.ChEMBL_531583 (CHEMBL990587)
IC50 200±n/a nM
Citation Jalali-Heravi, MAsadollahi-Baboli, MShahbazikhah, P QSAR study of heparanase inhibitors activity using artificial neural networks and Levenberg-Marquardt algorithm. Eur J Med Chem43:548-56 (2008) 
 
Heparanase
Name:Heparanase
Type:PROTEIN
Mol. Mass.:61167.67
Organism:Homo sapiens (Human)
Description:ChEMBL_327900
Residue:543
BDBM50147546
NameBDBM50147546
Synonyms:2-(3-(5-(benzo[d][1,3]dioxol-5-yl)benzo[d]oxazol-2-yl)-4-methoxyphenyl)-1,3-dioxoisoindoline-5-carboxylic acid CHEMBL326904
TypeSmall organic molecule
Emp. Form.C30H18N2O8
Mol. Mass.534.4725
SMILESCOc1ccc(cc1-c1nc2cc(ccc2o1)-c1ccc2OCOc2c1)N1C(=O)c2ccc(cc2C1=O)C(O)=O