Reaction Details
Target5-hydroxytryptamine receptor 1A
LigandBDBM50412118
Substrate/Competitorn/a
Meas. Tech.ChEMBL_556304 (CHEMBL953250)
Ki 2±n/a nM
Citation Ward, SEEddershaw, PJScott, CMGordon, LJLovell, PJMoore, SHSmith, PWStarr, KRThewlis, KMWatson, JM Discovery of potent, orally bioavailable, selective 5-HT1A/B/D receptor antagonists. J Med Chem51:2887-90 (2008) 
 
5-hydroxytryptamine receptor 1A
Name:5-hydroxytryptamine receptor 1A
Type:n/a
Mol. Mass.:46122.49
Organism:Homo sapiens (Human)
Description:n/a
Residue:422
BDBM50412118
NameBDBM50412118
Synonyms:CHEMBL494806
TypeSmall organic molecule
Emp. Form.C25H30N4O2
Mol. Mass.418.5313
SMILESCC(=O)Nc1cccc(CN2CCN(CCOc3cccc4nc(C)ccc34)CC2)c1