Reaction Details
TargetSodium-dependent serotonin transporter
LigandBDBM50412126
Substrate/Competitorn/a
Meas. Tech.ChEMBL_556308 (CHEMBL954043)
Ki 251±n/a nM
Citation Ward, SEEddershaw, PJScott, CMGordon, LJLovell, PJMoore, SHSmith, PWStarr, KRThewlis, KMWatson, JM Discovery of potent, orally bioavailable, selective 5-HT1A/B/D receptor antagonists. J Med Chem51:2887-90 (2008) 
 
Sodium-dependent serotonin transporter
Name:Sodium-dependent serotonin transporter
Type:Multi-pass membrane protein
Mol. Mass.:70168.43
Organism:Rattus norvegicus (rat)
Description:P31652
Residue:630
BDBM50412126
NameBDBM50412126
Synonyms:CHEMBL525362
TypeSmall organic molecule
Emp. Form.C27H34N4O2
Mol. Mass.446.5845
SMILESCCNC(=O)Nc1cccc(CC2CCN(CCOc3cccc4nc(C)ccc34)CC2)c1