Reaction Details
TargetPotassium voltage-gated channel subfamily H member 2
LigandBDBM50131441
Substrate/Competitorn/a
Meas. Tech.ChEMBL_556369 (CHEMBL954102)
IC50 100000±n/a nM
Citation Jia, LSun, H Support vector machines classification of hERG liabilities based on atom types. Bioorg Med Chem16:6252-60 (2008) 
 
Potassium voltage-gated channel subfamily H member 2
Name:Potassium voltage-gated channel subfamily H member 2
Type:Multi-pass membrane protein
Mol. Mass.:126672.65
Organism:Homo sapiens (Human)
Description:Q12809
Residue:1159
BDBM50131441
NameBDBM50131441
Synonyms:9,13b-dihydro-1H-dibenzo[c,f]imidazo[1,5-a]azepin-3-amine EPINASTINE Flurinol WAL 801 | epinastine hydrochloride
TypeSmall organic molecule
Emp. Form.C16H15N3
Mol. Mass.249.3104
SMILESNC1=NCC2N1c1ccccc1Cc1ccccc21